BDBM507123 US11046675, Example 1002
SMILES Cc1c(COc2cc(OCc3cncc(c3)C#N)cc3CCN(CC(O)=O)Cc23)cccc1-c1ccc2OCCOc2c1
InChI Key InChIKey=QIOYVMNPFVSENV-UHFFFAOYSA-N
Data  1 IC50
  Tab Delimited (TSV)   2D SDfile   Computed 3D by Vconf -m prep SDfile
Find this compound or compounds like it in BindingDB:
Activity Spreadsheet -- Enzyme Inhibition Constant Data from BindingDB
Found 1 hit for monomerid = 507123
LigandPNGBDBM507123(US11046675, Example 1002)
Affinity DataIC50:  775nM. Assay description: The interaction of PD-1 and PD-L1 can be assessed using soluble, purified preparations of the extracellular domains of the two proteins. The PD-1 and...
Ligand InfoPC cidPC sid
In DepthDetails US Patent